Target
Carbonic anhydrase 1
Ligand
BDBM50240969
Substrate
Meas. Tech.
ChEMBL_497172 (CHEMBL1002072)
Ki
4160±n/a nM
Citation
 Bayram, ESenturk, MKufrevioglu, OISupuran, CT In vitro inhibition of salicylic acid derivatives on human cytosolic carbonic anhydrase isozymes I and II. Bioorg Med Chem 16:9101-5 (2008)  
Target
Name:
Carbonic anhydrase 1
Synonyms:
CA-I CAB Carbonate dehydratase I Carbonic anhydrase 1 (CA I) Carbonic anhydrase 1 (Recombinant CA I) Carbonic anhydrase B Carbonic anhydrase I (CA I) Carbonic anhydrase I (CAI) Carbonic anhydrase isoenzyme I (hCA I) | hCA
Type:
Enzyme
Mol. Mass.:
28873.37
Organism:
Homo sapiens (Human)
Description:
P00915
Residue:
261
  
Inhibitor
Name:
BDBM50240969
Synonyms:
5-Chloro-2-hydroxy-benzoic acid CHEMBL1375
Type:
Small organic molecule
Emp. Form.:
C7H5ClO3
Mol. Mass.:
172.566
SMILES:
OC(=O)c1cc(Cl)ccc1O
: