Target
Muscarinic acetylcholine receptor M1
Ligand
BDBM50275345
Substrate
Meas. Tech.
ChEMBL_492754 (CHEMBL938553)
EC50
1400±n/a nM
Citation
 Miller, NRDaniels, RNBridges, TMBrady, AEConn, PJLindsley, CW Synthesis and SAR of analogs of the M1 allosteric agonist TBPB. Part II: Amides, sulfonamides and ureas--the effect of capping the distal basic piperidine nitrogen. Bioorg Med Chem Lett 18:5443-7 (2008)  
Target
Name:
Muscarinic acetylcholine receptor M1
Synonyms:
ACM1_HUMAN Cholinergic receptor, muscarinic 1 | Cholinergic, muscarinic M1
Type:
Protein
Mol. Mass.:
51442.54
Organism:
Homo sapiens (Human)
Description:
P11229
Residue:
460
  
Inhibitor
Name:
BDBM50275345
Synonyms:
1-(1'-(phenylsulfonyl)-1,4'-bipiperidin-4-yl)-1H-benzo[d]imidazol-2(3H)-one | CHEMBL487762
Type:
Small organic molecule
Emp. Form.:
C23H28N4O3S
Mol. Mass.:
440.558
SMILES:
O=c1[nH]c2ccccc2n1C1CCN(CC1)C1CCN(CC1)S(=O)(=O)c1ccccc1
: