Target
Adenosine receptor A2a
Ligand
BDBM26236
Substrate
Meas. Tech.
ChEMBL_492788 (CHEMBL939476)
Ki
0.2±n/a nM
Citation
 Moorjani, MLuo, ZLin, EVong, BGChen, YZhang, XRueter, JKGross, RSLanier, MCTellew, JEWilliams, JPLechner, SMMalany, SSantos, MCrespo, MIDíaz, JLSaunders, JSlee, DH 2,6-Diaryl-4-acylaminopyrimidines as potent and selective adenosine A(2A) antagonists with improved solubility and metabolic stability. Bioorg Med Chem Lett 18:5402-5 (2008)  
Target
Name:
Adenosine receptor A2a
Synonyms:
A2A adenosine receptor (hA2A) ADENOSINE A2 ADORA2 Adenosine A2A receptor (A2AAR)
Type:
G Protein-Coupled Receptor (GPCR)
Mol. Mass.:
44716.46
Organism:
Homo sapiens (Human)
Description:
P29274
Residue:
412
  
Inhibitor
Name:
BDBM26236
Synonyms:
CHEMBL487569 pyrazolylpyrimidine derivative, 6f
Type:
Small organic molecule
Emp. Form.:
C19H21N5O3
Mol. Mass.:
367.4017
SMILES:
COc1cc(OC)cc(c1)-c1cc(NC(C)=O)nc(n1)-n1nc(C)cc1C
: