Target
Adenosine receptor A2a
Ligand
BDBM50275961
Substrate
Meas. Tech.
ChEMBL_492788 (CHEMBL939476)
Ki
1±n/a nM
Citation
 Moorjani, MLuo, ZLin, EVong, BGChen, YZhang, XRueter, JKGross, RSLanier, MCTellew, JEWilliams, JPLechner, SMMalany, SSantos, MCrespo, MIDíaz, JLSaunders, JSlee, DH 2,6-Diaryl-4-acylaminopyrimidines as potent and selective adenosine A(2A) antagonists with improved solubility and metabolic stability. Bioorg Med Chem Lett 18:5402-5 (2008)  
Target
Name:
Adenosine receptor A2a
Synonyms:
A2A adenosine receptor (hA2A) ADENOSINE A2 ADORA2 Adenosine A2A receptor (A2AAR)
Type:
G Protein-Coupled Receptor (GPCR)
Mol. Mass.:
44716.46
Organism:
Homo sapiens (Human)
Description:
P29274
Residue:
412
  
Inhibitor
Name:
BDBM50275961
Synonyms:
CHEMBL472460 | N-(2-(3,5-dimethyl-1H-pyrazol-1-yl)-6-(3-fluoro-5-(1-methylpyrrolidin-3-yloxy)phenyl)pyrimidin-4-yl)acetamide
Type:
Small organic molecule
Emp. Form.:
C22H25FN6O2
Mol. Mass.:
424.4713
SMILES:
CN1CCC(C1)Oc1cc(F)cc(c1)-c1cc(NC(C)=O)nc(n1)-n1nc(C)cc1C
: