Target
Metabotropic glutamate receptor 1
Ligand
BDBM50273897
Substrate
Meas. Tech.
ChEMBL_537950 (CHEMBL1032406)
IC50
220±n/a nM
Citation
 Ito, SSatoh, ANagatomi, YHirata, YSuzuki, GKimura, TSatow, AMaehara, SHikichi, HHata, MKawamoto, HOhta, H Discovery and biological profile of 4-(1-aryltriazol-4-yl)-tetrahydropyridines as an orally active new class of metabotropic glutamate receptor 1 antagonist. Bioorg Med Chem 16:9817-29 (2008)  
Target
Name:
Metabotropic glutamate receptor 1
Synonyms:
GPRC1A GRM1_HUMAN Metabotropic Glutamate 1a | metabotropic glutamate 1
Type:
Enzyme
Mol. Mass.:
132358.19
Organism:
Homo sapiens (Human)
Description:
Q13255
Residue:
1194
  
Inhibitor
Name:
BDBM50273897
Synonyms:
CHEMBL457873 | tert-Butyl-4-[1-pyridin-4-yl-1 H-1,2,3-triazol-4-yl]-3,6-dihydropyridine-1(2H)-carboxylate
Type:
Small organic molecule
Emp. Form.:
C17H21N5O2
Mol. Mass.:
327.3809
SMILES:
CC(C)(C)OC(=O)N1CCC(=CC1)c1cn(nn1)-c1ccncc1
: