Target
Metabotropic glutamate receptor 1
Ligand
BDBM50273940
Substrate
Meas. Tech.
ChEMBL_537951 (CHEMBL1032407)
IC50
180±n/a nM
Citation
 Ito, SSatoh, ANagatomi, YHirata, YSuzuki, GKimura, TSatow, AMaehara, SHikichi, HHata, MKawamoto, HOhta, H Discovery and biological profile of 4-(1-aryltriazol-4-yl)-tetrahydropyridines as an orally active new class of metabotropic glutamate receptor 1 antagonist. Bioorg Med Chem 16:9817-29 (2008)  
Target
Name:
Metabotropic glutamate receptor 1
Synonyms:
GRM1_MOUSE Grm1 | Mglur1
Type:
PROTEIN
Mol. Mass.:
133215.40
Organism:
Mus musculus
Description:
ChEMBL_698434
Residue:
1199
  
Inhibitor
Name:
BDBM50273940
Synonyms:
CHEMBL457026 | iso-Propyl-4-[1-(2-fuluoropyridine-3-yl)-1H-1,2,3-triazol-4-yl]-3,6-dihydropyridine-1(2H)-carboxylate
Type:
Small organic molecule
Emp. Form.:
C16H18FN5O2
Mol. Mass.:
331.3448
SMILES:
CC(C)OC(=O)N1CCC(=CC1)c1cn(nn1)-c1cccnc1F
: