Target
Metabotropic glutamate receptor 5
Ligand
BDBM50273828
Substrate
Meas. Tech.
ChEMBL_537952 (CHEMBL1032408)
IC50
820±n/a nM
Citation
 Ito, SSatoh, ANagatomi, YHirata, YSuzuki, GKimura, TSatow, AMaehara, SHikichi, HHata, MKawamoto, HOhta, H Discovery and biological profile of 4-(1-aryltriazol-4-yl)-tetrahydropyridines as an orally active new class of metabotropic glutamate receptor 1 antagonist. Bioorg Med Chem 16:9817-29 (2008)  
Target
Name:
Metabotropic glutamate receptor 5
Synonyms:
GPRC1E GRM5_HUMAN metabotropic glutamate 5 | metabotropic glutamate 5a
Type:
Enzyme
Mol. Mass.:
132484.72
Organism:
Homo sapiens (Human)
Description:
Residue:
1212
  
Inhibitor
Name:
BDBM50273828
Synonyms:
CHEMBL511355 | tert-Butyl-4-(1-phenyl-1H-1,2,3-triazole-4-yl)-3,6-dihydropyridine-1(2H)-carboxylate
Type:
Small organic molecule
Emp. Form.:
C18H22N4O2
Mol. Mass.:
326.3929
SMILES:
CC(C)(C)OC(=O)N1CCC(=CC1)c1cn(nn1)-c1ccccc1
: