Target
Prostaglandin G/H synthase 1
Ligand
BDBM50009859
Substrate
Meas. Tech.
ChEMBL_492902 (CHEMBL942233)
IC50
2900±n/a nM
Citation
 Abdellatif, KRChowdhury, MADong, YVelázquez, CDas, DSuresh, MRKnaus, EE Diazen-1-ium-1,2-diolated nitric oxide donor ester prodrugs of 5-(4-hydroxymethylphenyl)-1-(4-aminosulfonylphenyl)-3-trifluoromethyl-1H-pyrazole and its methanesulfonyl analog: synthesis, biological evaluation and nitric oxide release studies. Bioorg Med Chem 16:9694-8 (2008)  
Target
Name:
Prostaglandin G/H synthase 1
Synonyms:
COX1 Cyclooxygenase-1 (COX-1) PTGS1 | Prostaglandin G/H synthase (cyclooxygenase)
Type:
Protein
Mol. Mass.:
68868.60
Organism:
Ovis aries (Sheep)
Description:
Residue:
600
  
Inhibitor
Name:
BDBM50009859
Synonyms:
(+-)-2-(p-isobutylphenyl)propionic acid (+-)-ibuprofen (4-isobutylphenyl)-alpha-methylacetic acid 2-(4-isobutylphenyl)propanoic acid 4-isobutylhydratropic acid Brufen IBUPROFEN LYSINE Ibuprofen (1) alpha-(4-isobutylphenyl)propionic acid | alpha-(p-isobutylphenyl)propionic acid
Type:
Small organic molecule
Emp. Form.:
C13H18O2
Mol. Mass.:
206.2808
SMILES:
CC(C)Cc1ccc(cc1)C(C)C(O)=O
: