Target
Tyrosine-protein kinase ZAP-70
Ligand
BDBM50249284
Substrate
Meas. Tech.
ChEMBL_492925 (CHEMBL945313)
Ki
3500±n/a nM
Citation
 Farmer, LJBemis, GBritt, SDCochran, JConnors, MHarrington, EMHoock, TMarkland, WNanthakumar, STaslimi, PTer Haar, EWang, JZhaveri, DSalituro, FG Discovery and SAR of novel 4-thiazolyl-2-phenylaminopyrimidines as potent inhibitors of spleen tyrosine kinase (SYK). Bioorg Med Chem Lett 18:6231-5 (2008)  
Target
Name:
Tyrosine-protein kinase ZAP-70
Synonyms:
70 kDa zeta-associated protein Syk-related tyrosine kinase Tyrosine-protein kinase ZAP-70 Tyrosine-protein kinase ZAP-70 (ZAP70) ZAP70 Zeta-chain (TCR) associated protein kinase 70kDa
Type:
Enzyme
Mol. Mass.:
69881.61
Organism:
Homo sapiens (Human)
Description:
ZAP-70 SH2 domain was expressed and purified from E. coli using O-phospho-L-tyrosine-agarose column.
Residue:
619
  
Inhibitor
Name:
BDBM50249284
Synonyms:
2-(4-methyl-2-(2-(3-methyl-5-(trifluoromethyl)phenylamino)pyrimidin-4-yl)thiazol-5-yl)ethanol | CHEMBL475249
Type:
Small organic molecule
Emp. Form.:
C18H17F3N4OS
Mol. Mass.:
394.414
SMILES:
Cc1nc(sc1CCO)-c1ccnc(Nc2cc(C)cc(c2)C(F)(F)F)n1
: