Target
Proto-oncogene tyrosine-protein kinase Src
Ligand
BDBM50276016
Substrate
Meas. Tech.
ChEMBL_492924 (CHEMBL945312)
Ki
1833±n/a nM
Citation
 Farmer, LJBemis, GBritt, SDCochran, JConnors, MHarrington, EMHoock, TMarkland, WNanthakumar, STaslimi, PTer Haar, EWang, JZhaveri, DSalituro, FG Discovery and SAR of novel 4-thiazolyl-2-phenylaminopyrimidines as potent inhibitors of spleen tyrosine kinase (SYK). Bioorg Med Chem Lett 18:6231-5 (2008)  
Target
Name:
Proto-oncogene tyrosine-protein kinase Src
Synonyms:
Calmodulin/Proto-oncogene tyrosine-protein kinase Src Proto-oncogene c-Src SRC SRC_HUMAN V-src sarcoma (Schmidt-Ruppin A-2) viral oncogene homolog (avian) p60-Src | pp60c-src
Type:
Protein
Mol. Mass.:
59838.60
Organism:
Homo sapiens (Human)
Description:
P12931
Residue:
536
  
Inhibitor
Name:
BDBM50276016
Synonyms:
CHEMBL512319 | N-(3-methoxy-5-(trifluoromethyl)phenyl)-4-(thiazol-2-yl)pyrimidin-2-amine
Type:
Small organic molecule
Emp. Form.:
C15H11F3N4OS
Mol. Mass.:
352.334
SMILES:
COc1cc(Nc2nccc(n2)-c2nccs2)cc(c1)C(F)(F)F
: