Target
Cyclin-dependent kinase 2
Ligand
BDBM50275358
Substrate
Meas. Tech.
ChEMBL_492922 (CHEMBL945310)
Ki
1500±n/a nM
Citation
 Farmer, LJBemis, GBritt, SDCochran, JConnors, MHarrington, EMHoock, TMarkland, WNanthakumar, STaslimi, PTer Haar, EWang, JZhaveri, DSalituro, FG Discovery and SAR of novel 4-thiazolyl-2-phenylaminopyrimidines as potent inhibitors of spleen tyrosine kinase (SYK). Bioorg Med Chem Lett 18:6231-5 (2008)  
Target
Name:
Cyclin-dependent kinase 2
Synonyms:
CDK2 CDK2_HUMAN Cell division protein kinase 2 Protein cereblon/Cyclin-dependent kinase 2 | p33 protein kinase
Type:
Enzyme Subunit
Mol. Mass.:
33938.17
Organism:
Homo sapiens (Human)
Description:
P24941
Residue:
298
  
Inhibitor
Name:
BDBM50275358
Synonyms:
(2-(2-(3-methyl-5-(trifluoromethyl)phenylamino)pyrimidin-4-yl)thiazol-4-yl)methanol | CHEMBL485731
Type:
Small organic molecule
Emp. Form.:
C16H13F3N4OS
Mol. Mass.:
366.361
SMILES:
Cc1cc(Nc2nccc(n2)-c2nc(CO)cs2)cc(c1)C(F)(F)F
: