Target
Tyrosine-protein kinase SYK
Ligand
BDBM50276017
Substrate
Meas. Tech.
ChEMBL_492921 (CHEMBL945309)
Ki
44±n/a nM
Citation
 Farmer, LJBemis, GBritt, SDCochran, JConnors, MHarrington, EMHoock, TMarkland, WNanthakumar, STaslimi, PTer Haar, EWang, JZhaveri, DSalituro, FG Discovery and SAR of novel 4-thiazolyl-2-phenylaminopyrimidines as potent inhibitors of spleen tyrosine kinase (SYK). Bioorg Med Chem Lett 18:6231-5 (2008)  
Target
Name:
Tyrosine-protein kinase SYK
Synonyms:
KSYK_HUMAN Spleen Tyrosine Kinase Tyrosine-protein kinase SYK (Syk)
Type:
Enzyme
Mol. Mass.:
72079.99
Organism:
Homo sapiens (Human)
Description:
P43405
Residue:
635
  
Inhibitor
Name:
BDBM50276017
Synonyms:
3-(4-(thiazol-2-yl)pyrimidin-2-ylamino)-5-(trifluoromethyl)phenol | CHEMBL470175
Type:
Small organic molecule
Emp. Form.:
C14H9F3N4OS
Mol. Mass.:
338.308
SMILES:
Oc1cc(Nc2nccc(n2)-c2nccs2)cc(c1)C(F)(F)F
: