Target
Tyrosine-protein kinase ZAP-70
Ligand
BDBM50275355
Substrate
Meas. Tech.
ChEMBL_492925 (CHEMBL945313)
Ki
1000±n/a nM
Citation
 Farmer, LJBemis, GBritt, SDCochran, JConnors, MHarrington, EMHoock, TMarkland, WNanthakumar, STaslimi, PTer Haar, EWang, JZhaveri, DSalituro, FG Discovery and SAR of novel 4-thiazolyl-2-phenylaminopyrimidines as potent inhibitors of spleen tyrosine kinase (SYK). Bioorg Med Chem Lett 18:6231-5 (2008)  
Target
Name:
Tyrosine-protein kinase ZAP-70
Synonyms:
70 kDa zeta-associated protein Syk-related tyrosine kinase Tyrosine-protein kinase ZAP-70 Tyrosine-protein kinase ZAP-70 (ZAP70) ZAP70 Zeta-chain (TCR) associated protein kinase 70kDa
Type:
Enzyme
Mol. Mass.:
69881.61
Organism:
Homo sapiens (Human)
Description:
ZAP-70 SH2 domain was expressed and purified from E. coli using O-phospho-L-tyrosine-agarose column.
Residue:
619
  
Inhibitor
Name:
BDBM50275355
Synonyms:
(2-(2-(3-methoxy-5-(trifluoromethyl)phenylamino)pyrimidin-4-yl)thiazol-4-yl)methanol | CHEMBL486751
Type:
Small organic molecule
Emp. Form.:
C16H13F3N4O2S
Mol. Mass.:
382.36
SMILES:
COc1cc(Nc2nccc(n2)-c2nc(CO)cs2)cc(c1)C(F)(F)F
: