Target
Tyrosine-protein kinase ZAP-70
Ligand
BDBM50275356
Substrate
Meas. Tech.
ChEMBL_492925 (CHEMBL945313)
Ki
680±n/a nM
Citation
 Farmer, LJBemis, GBritt, SDCochran, JConnors, MHarrington, EMHoock, TMarkland, WNanthakumar, STaslimi, PTer Haar, EWang, JZhaveri, DSalituro, FG Discovery and SAR of novel 4-thiazolyl-2-phenylaminopyrimidines as potent inhibitors of spleen tyrosine kinase (SYK). Bioorg Med Chem Lett 18:6231-5 (2008)  
Target
Name:
Tyrosine-protein kinase ZAP-70
Synonyms:
70 kDa zeta-associated protein Syk-related tyrosine kinase Tyrosine-protein kinase ZAP-70 Tyrosine-protein kinase ZAP-70 (ZAP70) ZAP70 Zeta-chain (TCR) associated protein kinase 70kDa
Type:
Enzyme
Mol. Mass.:
69881.61
Organism:
Homo sapiens (Human)
Description:
ZAP-70 SH2 domain was expressed and purified from E. coli using O-phospho-L-tyrosine-agarose column.
Residue:
619
  
Inhibitor
Name:
BDBM50275356
Synonyms:
3-(4-(4-(hydroxymethyl)thiazol-2-yl)pyrimidin-2-ylamino)-5-(trifluoromethyl)phenol | CHEMBL485730
Type:
Small organic molecule
Emp. Form.:
C15H11F3N4O2S
Mol. Mass.:
368.334
SMILES:
OCc1csc(n1)-c1ccnc(Nc2cc(O)cc(c2)C(F)(F)F)n1
: