Target
Peroxisome proliferator-activated receptor gamma
Ligand
BDBM50246525
Substrate
Meas. Tech.
ChEMBL_558115 (CHEMBL959044)
EC50
11±n/a nM
Citation
 Martres, PFaucher, NLaroze, APineau, OFouchet, MHPotvain, FGrillot, DBeneton, V The discovery of equipotent PPARalpha/gamma dual activators. Bioorg Med Chem Lett 18:6251-4 (2008)  
Target
Name:
Peroxisome proliferator-activated receptor gamma
Synonyms:
Nr1c3 PPAR-gamma Pparg
Type:
PROTEIN
Mol. Mass.:
57593.55
Organism:
Mus musculus
Description:
ChEMBL_1453700
Residue:
505
  
Inhibitor
Name:
BDBM50246525
Synonyms:
2-(4-((5-(4-tert-butylphenyl)-1-methyl-1H-pyrazole-3-carboxamido)methyl)-2-methylphenoxy)-2-methylpropanoic acid | CHEMBL518348
Type:
Small organic molecule
Emp. Form.:
C27H33N3O4
Mol. Mass.:
463.5686
SMILES:
Cc1cc(CNC(=O)c2cc(-c3ccc(cc3)C(C)(C)C)n(C)n2)ccc1OC(C)(C)C(O)=O
: