Target
Peroxisome proliferator-activated receptor gamma
Ligand
BDBM50245782
Substrate
Meas. Tech.
ChEMBL_558115 (CHEMBL959044)
EC50
16±n/a nM
Citation
 Martres, PFaucher, NLaroze, APineau, OFouchet, MHPotvain, FGrillot, DBeneton, V The discovery of equipotent PPARalpha/gamma dual activators. Bioorg Med Chem Lett 18:6251-4 (2008)  
Target
Name:
Peroxisome proliferator-activated receptor gamma
Synonyms:
Nr1c3 PPAR-gamma Pparg
Type:
PROTEIN
Mol. Mass.:
57593.55
Organism:
Mus musculus
Description:
ChEMBL_1453700
Residue:
505
  
Inhibitor
Name:
BDBM50245782
Synonyms:
2-(4-((5-(4-isopropylphenyl)-1-methyl-1H-pyrazole-3-carboxamido)methyl)-2-methylphenoxy)-2-methylpropanoic acid | CHEMBL455157
Type:
Small organic molecule
Emp. Form.:
C26H31N3O4
Mol. Mass.:
449.542
SMILES:
CC(C)c1ccc(cc1)-c1cc(nn1C)C(=O)NCc1ccc(OC(C)(C)C(O)=O)c(C)c1
: