Target
Focal adhesion kinase 1
Ligand
BDBM50246378
Substrate
Meas. Tech.
ChEMBL_558213 (CHEMBL962347)
IC50
1±n/a nM
Citation
 Walker, DPBi, FCKalgutkar, ASBauman, JNZhao, SXSoglia, JRAspnes, GEKung, DWKlug-McLeod, JZawistoski, MPMcGlynn, MAOliver, RDunn, MLi, JCRichter, DTCooper, BAKath, JCHulford, CAAutry, CLLuzzio, MJUng, EJRoberts, WGBonnette, PCBuckbinder, LMistry, AGriffor, MCHan, SGuzman-Perez, A Trifluoromethylpyrimidine-based inhibitors of proline-rich tyrosine kinase 2 (PYK2): structure-activity relationships and strategies for the elimination of reactive metabolite formation. Bioorg Med Chem Lett 18:6071-7 (2008)  
Target
Name:
Focal adhesion kinase 1
Synonyms:
FADK 1 FAK1 FLT4 Focal adhesion kinase (FAK) Focal adhesion kinase 1 (FAK) Focal adhesion kinase-related nonkinase PTK2 Protein-tyrosine kinase 2 p125FAK | pp125FAK
Type:
Tyrosine-protein kinase
Mol. Mass.:
119233.17
Organism:
Homo sapiens (Human)
Description:
Q05397
Residue:
1052
  
Inhibitor
Name:
BDBM50246378
Synonyms:
CHEMBL452341 | N-(2-{[2-(2,2-Dioxo-2,3-dihydro-1H-2lambda6-benzo[c]isothiazol-5-ylamino)-5-trifluoromethyl-pyrimidin-4-ylamino]-methyl}-phenyl)-N-methyl-methanesulfonamide
Type:
Small organic molecule
Emp. Form.:
C21H21F3N6O4S2
Mol. Mass.:
542.554
SMILES:
CN(c1ccccc1CNc1nc(Nc2ccc3NS(=O)(=O)Cc3c2)ncc1C(F)(F)F)S(C)(=O)=O
: