Target
Potassium voltage-gated channel subfamily H member 2
Ligand
BDBM50275825
Substrate
Meas. Tech.
ChEMBL_493116 (CHEMBL940379)
Ki
19250±n/a nM
Citation
 Methot, JLHamblett, CLMampreian, DMJung, JHarsch, ASzewczak, AADahlberg, WKMiddleton, REHughes, BFleming, JCWang, HKral, AMOzerova, NCruz, JCHaines, BChenard, MKenific, CMSecrist, JPMiller, TA SAR profiles of spirocyclic nicotinamide derived selective HDAC1/HDAC2 inhibitors (SHI-1:2). Bioorg Med Chem Lett 18:6104-9 (2008)  
Target
Name:
Potassium voltage-gated channel subfamily H member 2
Synonyms:
1,3-beta-glucan synthase component GLS2 ERG Eag-related protein 1 Ether-a-go-go-related gene (HERG) Ether-a-go-go-related gene potassium channel 1 Ether-a-go-go-related gene potassium channel 1 (hERG1) Ether-a-go-go-related protein 1 H-ERG KCNH2 Potassium voltage-gated channel subfamily H member 2 (hERG) Voltage-gated potassium channel subunit Kv11.1 hERG Potassium Channel 1 | putative potassium channel subunit
Type:
Multi-pass membrane protein
Mol. Mass.:
126672.65
Organism:
Homo sapiens (Human)
Description:
Q12809
Residue:
1159
  
Inhibitor
Name:
BDBM50275825
Synonyms:
CHEMBL470156 | N-(2-amino-5-(1-methyl-1H-pyrazol-4-yl)phenyl)-6-(2,8-diazaspiro[4.5]decan-8-yl)nicotinamide
Type:
Small organic molecule
Emp. Form.:
C24H29N7O
Mol. Mass.:
431.5334
SMILES:
Cn1cc(cn1)-c1ccc(N)c(NC(=O)c2ccc(nc2)N2CCC3(CCNC3)CC2)c1
: