Target
Histone deacetylase 1
Ligand
BDBM50275827
Substrate
Meas. Tech.
ChEMBL_493106 (CHEMBL940369)
IC50
22±n/a nM
Citation
 Methot, JLHamblett, CLMampreian, DMJung, JHarsch, ASzewczak, AADahlberg, WKMiddleton, REHughes, BFleming, JCWang, HKral, AMOzerova, NCruz, JCHaines, BChenard, MKenific, CMSecrist, JPMiller, TA SAR profiles of spirocyclic nicotinamide derived selective HDAC1/HDAC2 inhibitors (SHI-1:2). Bioorg Med Chem Lett 18:6104-9 (2008)  
Target
Name:
Histone deacetylase 1
Synonyms:
Cereblon/Histone deacetylase 1 HDAC1 Histone deacetylase 1 (HDAC1) RPD3L1
Type:
Enzyme
Mol. Mass.:
55090.27
Organism:
Homo sapiens (Human)
Description:
Q13547
Residue:
482
  
Inhibitor
Name:
BDBM50275827
Synonyms:
CHEMBL472252 | N-(2-amino-5-(1-methyl-1H-imidazol-4-yl)phenyl)-6-(2,8-diazaspiro[4.5]decan-8-yl)nicotinamide
Type:
Small organic molecule
Emp. Form.:
C24H29N7O
Mol. Mass.:
431.5334
SMILES:
Cn1cnc(c1)-c1ccc(N)c(NC(=O)c2ccc(nc2)N2CCC3(CCNC3)CC2)c1
: