Target
Histone deacetylase 1
Ligand
BDBM50275940
Substrate
Meas. Tech.
ChEMBL_493106 (CHEMBL940369)
IC50
17±n/a nM
Citation
 Methot, JLHamblett, CLMampreian, DMJung, JHarsch, ASzewczak, AADahlberg, WKMiddleton, REHughes, BFleming, JCWang, HKral, AMOzerova, NCruz, JCHaines, BChenard, MKenific, CMSecrist, JPMiller, TA SAR profiles of spirocyclic nicotinamide derived selective HDAC1/HDAC2 inhibitors (SHI-1:2). Bioorg Med Chem Lett 18:6104-9 (2008)  
Target
Name:
Histone deacetylase 1
Synonyms:
Cereblon/Histone deacetylase 1 HDAC1 Histone deacetylase 1 (HDAC1) RPD3L1
Type:
Enzyme
Mol. Mass.:
55090.27
Organism:
Homo sapiens (Human)
Description:
Q13547
Residue:
482
  
Inhibitor
Name:
BDBM50275940
Synonyms:
CHEMBL472261 | N-(2-amino-5-(thiophen-2-yl)phenyl)-6-(2-(2,2,2-trifluoroethyl)-2,8-diazaspiro[4.5]decan-8-yl)nicotinamide
Type:
Small organic molecule
Emp. Form.:
C26H28F3N5OS
Mol. Mass.:
515.594
SMILES:
Nc1ccc(cc1NC(=O)c1ccc(nc1)N1CCC2(CCN(CC(F)(F)F)C2)CC1)-c1cccs1
: