Target
Histone deacetylase 1
Ligand
BDBM50275985
Substrate
Meas. Tech.
ChEMBL_493106 (CHEMBL940369)
IC50
23±n/a nM
Citation
 Methot, JLHamblett, CLMampreian, DMJung, JHarsch, ASzewczak, AADahlberg, WKMiddleton, REHughes, BFleming, JCWang, HKral, AMOzerova, NCruz, JCHaines, BChenard, MKenific, CMSecrist, JPMiller, TA SAR profiles of spirocyclic nicotinamide derived selective HDAC1/HDAC2 inhibitors (SHI-1:2). Bioorg Med Chem Lett 18:6104-9 (2008)  
Target
Name:
Histone deacetylase 1
Synonyms:
Cereblon/Histone deacetylase 1 HDAC1 Histone deacetylase 1 (HDAC1) RPD3L1
Type:
Enzyme
Mol. Mass.:
55090.27
Organism:
Homo sapiens (Human)
Description:
Q13547
Residue:
482
  
Inhibitor
Name:
BDBM50275985
Synonyms:
6-(2-acetyl-2,7-diazaspiro[3.5]nonan-7-yl)-N-(2-amino-5-(thiophen-2-yl)phenyl)nicotinamide | CHEMBL472443
Type:
Small organic molecule
Emp. Form.:
C25H27N5O2S
Mol. Mass.:
461.579
SMILES:
CC(=O)N1CC2(C1)CCN(CC2)c1ccc(cn1)C(=O)Nc1cc(ccc1N)-c1cccs1
: