Target
Sodium-dependent noradrenaline transporter
Ligand
BDBM50274949
Substrate
Meas. Tech.
ChEMBL_493416 (CHEMBL944373)
Ki
11±n/a nM
Citation
 Bannwart, LMCarter, DSCai, HYChoy, JCGreenhouse, RJaime-Figueroa, SIyer, PSLin, CJLee, EKLucas, MCLynch, SMMadera, AMMoore, AOzboya, KRaptova, LRoetz, RSchoenfeld, RCStein, KASteiner, SVilla, MWeikert, RJZhai, Y Novel 3,3-disubstituted pyrrolidines as selective triple serotonin/norepinephrine/dopamine reuptake inhibitors. Bioorg Med Chem Lett 18:6062-6 (2008)  
Target
Name:
Sodium-dependent noradrenaline transporter
Synonyms:
Monoamine transporter NET Noradrenaline Transporter (NET) Norepinephrine transporter protein (NET) SLC6A2 Sodium-dependent noradrenaline transporter (NET) | Solute carrier family 6 member 2
Type:
Multi-pass membrane protein
Mol. Mass.:
69337.72
Organism:
Homo sapiens (Human)
Description:
P23975
Residue:
617
  
Inhibitor
Name:
BDBM50274949
Synonyms:
5-(3-(3-methoxybenzyl)pyrrolidin-3-yl)-1H-indole | CHEMBL514759
Type:
Small organic molecule
Emp. Form.:
C20H22N2O
Mol. Mass.:
306.4015
SMILES:
COc1cccc(CC2(CCNC2)c2ccc3[nH]ccc3c2)c1
: