Target
Sodium-dependent noradrenaline transporter
Ligand
BDBM50274976
Substrate
Meas. Tech.
ChEMBL_493416 (CHEMBL944373)
Ki
5±n/a nM
Citation
 Bannwart, LMCarter, DSCai, HYChoy, JCGreenhouse, RJaime-Figueroa, SIyer, PSLin, CJLee, EKLucas, MCLynch, SMMadera, AMMoore, AOzboya, KRaptova, LRoetz, RSchoenfeld, RCStein, KASteiner, SVilla, MWeikert, RJZhai, Y Novel 3,3-disubstituted pyrrolidines as selective triple serotonin/norepinephrine/dopamine reuptake inhibitors. Bioorg Med Chem Lett 18:6062-6 (2008)  
Target
Name:
Sodium-dependent noradrenaline transporter
Synonyms:
Monoamine transporter NET Noradrenaline Transporter (NET) Norepinephrine transporter protein (NET) SLC6A2 Sodium-dependent noradrenaline transporter (NET) | Solute carrier family 6 member 2
Type:
Multi-pass membrane protein
Mol. Mass.:
69337.72
Organism:
Homo sapiens (Human)
Description:
P23975
Residue:
617
  
Inhibitor
Name:
BDBM50274976
Synonyms:
5-(3-benzylpyrrolidin-3-yl)-1H-indole-3-carbonitrile | CHEMBL517305
Type:
Small organic molecule
Emp. Form.:
C20H19N3
Mol. Mass.:
301.385
SMILES:
N#Cc1c[nH]c2ccc(cc12)C1(Cc2ccccc2)CCNC1
: