Target
Gag polyprotein
Ligand
BDBM50240439
Substrate
Meas. Tech.
ChEMBL_536774 (CHEMBL984568)
IC50
7500±n/a nM
Citation
 LaFrate, ALGunther, JRCarlson, KEKatzenellenbogen, JA Synthesis and biological evaluation of guanylhydrazone coactivator binding inhibitors for the estrogen receptor. Bioorg Med Chem 16:10075-84 (2008)  
Target
Name:
Gag polyprotein
Synonyms:
GAG_AVIER | gag
Type:
PROTEIN
Mol. Mass.:
61664.68
Organism:
Avian erythroblastosis virus (strain ES4)
Description:
ChEMBL_536774
Residue:
555
  
Inhibitor
Name:
BDBM50240439
Synonyms:
2-(1-Naphthalenylmethylene) hydrazinecarboximidamide N''-[(1E)-1-naphthylmethylene]carbonohydrazonic diamide
Type:
Small organic molecule
Emp. Form.:
C12H12N4
Mol. Mass.:
212.2505
SMILES:
[#7]\[#6](-[#7])=[#7]\[#7]=[#6]-c1cccc2ccccc12
: