Target
Envelope glycoprotein gp160
Ligand
BDBM50253469
Substrate
Meas. Tech.
ChEMBL_536779 (CHEMBL984573)
IC50
25000000±n/a nM
Citation
 LaFrate, ALGunther, JRCarlson, KEKatzenellenbogen, JA Synthesis and biological evaluation of guanylhydrazone coactivator binding inhibitors for the estrogen receptor. Bioorg Med Chem 16:10075-84 (2008)  
Target
Name:
Envelope glycoprotein gp160
Synonyms:
ENV_HV1BR env
Type:
PROTEIN
Mol. Mass.:
97512.49
Organism:
Human immunodeficiency virus type 1 (isolate BRU/LAI group M subtypeB) (HIV-1)
Description:
ChEMBL_536779
Residue:
861
  
Inhibitor
Name:
BDBM50253469
Synonyms:
1-Chloro-3,4-dihydronaphthalene-2-carboxaldehyde guanylhydrazone CHEMBL448651
Type:
Small organic molecule
Emp. Form.:
C12H13ClN4
Mol. Mass.:
248.711
SMILES:
[#7]\[#6](-[#7])=[#7]\[#7]=[#6]-[#6]-1=[#6](Cl)-c2ccccc2-[#6]-[#6]-1
: