Target
Cannabinoid receptor 2
Ligand
BDBM50256218
Substrate
Meas. Tech.
ChEMBL_519287 (CHEMBL947739)
Ki
0.9±n/a nM
Citation
 Kai, HMorioka, YKoriyama, YOkamoto, KHasegawa, YHattori, MKoike, KChiba, HShinohara, SIwamoto, YTakahashi, KTanimoto, N 2-Arylimino-5,6-dihydro-4H-1,3-thiazines as a new class of cannabinoid receptor agonists. Part 3: Synthesis and activity of isosteric analogs. Bioorg Med Chem Lett 18:6444-7 (2008)  
Target
Name:
Cannabinoid receptor 2
Synonyms:
CANNABINOID CB2 CB2 CB2B CNR2_HUMAN Cannabinoid CB2 receptor Cannabinoid receptor 2 (CB2R) | hCB2
Type:
G Protein-Coupled Receptor (GPCR)
Mol. Mass.:
39690.94
Organism:
Homo sapiens (Human)
Description:
P34972
Residue:
360
  
Inhibitor
Name:
BDBM50256218
Synonyms:
CHEMBL516406 | methyl 3-(naphthalen-1-ylimino)-2-oxa-4-azaspiro[5.5]undecane-4-carbodithioate
Type:
Small organic molecule
Emp. Form.:
C21H24N2OS2
Mol. Mass.:
384.558
SMILES:
CSC(=S)N1CC2(CCCCC2)CO\C1=N/c1cccc2ccccc12
: