Target
E3 ubiquitin-protein ligase Mdm2
Ligand
BDBM50273972
Substrate
Meas. Tech.
ChEMBL_536786 (CHEMBL988050)
IC50
58600±n/a nM
Citation
 Clement, JAKitagaki, JYang, YSaucedo, CJO'Keefe, BRWeissman, AMMcKee, TCMcMahon, JB Discovery of new pyridoacridine alkaloids from Lissoclinum cf. badium that inhibit the ubiquitin ligase activity of Hdm2 and stabilize p53. Bioorg Med Chem 16:10022-8 (2008)  
Target
Name:
E3 ubiquitin-protein ligase Mdm2
Synonyms:
Double minute 2 protein E3 ubiquitin-protein ligase Mdm2 (p53-binding protein Mdm2) Human Double Minute 2 (HDM2) MDM2-MDMX p53-Binding Protein MDM2 | p53-binding protein
Type:
Oncoprotein
Mol. Mass.:
55196.54
Organism:
Homo sapiens (Human)
Description:
Q00987
Residue:
491
  
Inhibitor
Name:
BDBM50273972
Synonyms:
CHEMBL461462 | Lissoclinidine B
Type:
Small organic molecule
Emp. Form.:
C18H15N3OS
Mol. Mass.:
321.396
SMILES:
NCCc1c2SCOc2c2[nH]ccc3c4ccccc4nc1c23
: