Target
Hydroxycarboxylic acid receptor 2
Ligand
BDBM50208138
Substrate
Meas. Tech.
ChEMBL_536823 (CHEMBL988087)
IC50
500±n/a nM
Citation
 Boatman, PDRichman, JGSemple, G Nicotinic acid receptor agonists. J Med Chem 51:7653-62 (2008)  
Target
Name:
Hydroxycarboxylic acid receptor 2
Synonyms:
G-protein coupled receptor 109A GPR109A HCAR2 HM74A NIACR1 Nicotinic acid receptor 1
Type:
G Protein-Coupled Receptor (GPCR)
Mol. Mass.:
41868.22
Organism:
Homo sapiens (Human)
Description:
Membranes from CHO cells expressing the recombinant human GPR109A were used in competition binding assay.
Residue:
363
  
Inhibitor
Name:
BDBM50208138
Synonyms:
(+)-acifran 5-Methyl-4-oxo-5-phenyl-4,5-dihydro-furan-2-carboxylic acid CHEMBL278488 | acifran
Type:
Small organic molecule
Emp. Form.:
C12H10O4
Mol. Mass.:
218.2054
SMILES:
CC1(OC(=CC1=O)C(O)=O)c1ccccc1
: