Target
Hydroxycarboxylic acid receptor 3
Ligand
BDBM50208122
Substrate
Meas. Tech.
ChEMBL_536824 (CHEMBL988088)
EC50
1720±n/a nM
Citation
 Boatman, PDRichman, JGSemple, G Nicotinic acid receptor agonists. J Med Chem 51:7653-62 (2008)  
Target
Name:
Hydroxycarboxylic acid receptor 3
Synonyms:
G-protein coupled receptor 109B G-protein coupled receptor HM74B HCA3 HCAR3_HUMAN HM74B NIACR2 Nicotinic acid receptor 2
Type:
Enzyme Catalytic Domain
Mol. Mass.:
44498.06
Organism:
Homo sapiens (Human)
Description:
GPR109B 0 HUMAN::P49019
Residue:
387
  
Inhibitor
Name:
BDBM50208122
Synonyms:
(+)-5-(5-chloro-thiophen-3-yl)-5-methyl-4-oxo-4,5-dihydro-furan-2-carboxylic acid 5-(5-chloro-thiophen-3-yl)-5-methyl-4-oxo-4,5-dihydro-furan-2-carboxylic acid CHEMBL221282
Type:
Small organic molecule
Emp. Form.:
C10H7ClO4S
Mol. Mass.:
258.678
SMILES:
CC1(OC(=CC1=O)C(O)=O)c1csc(Cl)c1
: