Target
Hydroxycarboxylic acid receptor 2
Ligand
BDBM50132142
Substrate
Meas. Tech.
ChEMBL_536825 (CHEMBL988089)
Ki
3500±n/a nM
Citation
 Boatman, PDRichman, JGSemple, G Nicotinic acid receptor agonists. J Med Chem 51:7653-62 (2008)  
Target
Name:
Hydroxycarboxylic acid receptor 2
Synonyms:
G-protein coupled receptor 109A GPR109A HCAR2 HM74A NIACR1 Nicotinic acid receptor 1
Type:
G Protein-Coupled Receptor (GPCR)
Mol. Mass.:
41868.22
Organism:
Homo sapiens (Human)
Description:
Membranes from CHO cells expressing the recombinant human GPR109A were used in competition binding assay.
Residue:
363
  
Inhibitor
Name:
BDBM50132142
Synonyms:
4,5,6,7-Tetrahydro-1H-indazole-3-carboxylic acid CHEMBL338405
Type:
Small organic molecule
Emp. Form.:
C8H10N2O2
Mol. Mass.:
166.1772
SMILES:
OC(=O)c1n[nH]c2CCCCc12
: