Target
Concanavalin-A
Ligand
BDBM50246208
Substrate
Meas. Tech.
ChEMBL_559137 (CHEMBL1012082)
IC50
29000±n/a nM
Citation
 Welch, KTTurner, TAPreast, CE Rational design of novel glycomimetics: inhibitors of concanavalin A. Bioorg Med Chem Lett 18:6573-5 (2008)  
Target
Name:
Concanavalin-A
Synonyms:
CONA_CANEN
Type:
PROTEIN
Mol. Mass.:
31477.03
Organism:
Canavalia ensiformis
Description:
ChEMBL_559137
Residue:
290
  
Inhibitor
Name:
BDBM50246208
Synonyms:
2-(3,4,5-trihydroxy-6-oxo-6H-xanthen-9-yl)cyclohexanecarboxylic acid cid_274122
Type:
Small organic molecule
Emp. Form.:
C20H18O7
Mol. Mass.:
370.3527
SMILES:
OC(=O)C1CCCCC1c1c2ccc(O)c(O)c2oc2c(O)c(=O)ccc12
: