Target
Activated CDC42 kinase 1
Ligand
BDBM50245906
Substrate
Meas. Tech.
ChEMBL_559411 (CHEMBL1017265)
Ki
10±n/a nM
Citation
 Kopecky, DJHao, XChen, YFu, JJiao, XJaen, JCCardozo, MGLiu, JWang, ZWalker, NPWesche, HLi, SFarrelly, EXiao, SHKayser, F Identification and optimization of N3,N6-diaryl-1H-pyrazolo[3,4-d]pyrimidine-3,6-diamines as a novel class of ACK1 inhibitors. Bioorg Med Chem Lett 18:6352-6 (2008)  
Target
Name:
Activated CDC42 kinase 1
Synonyms:
ACK1 Activated CDC42 kinase 1 (ACK-1) Tyrosine kinase non-receptor protein 2
Type:
Protein
Mol. Mass.:
114577.86
Organism:
Homo sapiens (Human)
Description:
Q07912
Residue:
1038
  
Inhibitor
Name:
BDBM50245906
Synonyms:
CHEMBL462189 | N3-(2,6-dichlorophenyl)-1-(2-(4-methylpiperazin-1-yl)ethyl)-N6-phenyl-1H-pyrazolo[3,4-d]pyrimidine-3,6-diamine
Type:
Small organic molecule
Emp. Form.:
C24H26Cl2N8
Mol. Mass.:
497.423
SMILES:
CN1CCN(CCn2nc(Nc3c(Cl)cccc3Cl)c3cnc(Nc4ccccc4)nc23)CC1
: