Target
Tyrosine-protein kinase Lck
Ligand
BDBM50245904
Substrate
Meas. Tech.
ChEMBL_559420 (CHEMBL1017274)
Ki
13±n/a nM
Citation
 Kopecky, DJHao, XChen, YFu, JJiao, XJaen, JCCardozo, MGLiu, JWang, ZWalker, NPWesche, HLi, SFarrelly, EXiao, SHKayser, F Identification and optimization of N3,N6-diaryl-1H-pyrazolo[3,4-d]pyrimidine-3,6-diamines as a novel class of ACK1 inhibitors. Bioorg Med Chem Lett 18:6352-6 (2008)  
Target
Name:
Tyrosine-protein kinase Lck
Synonyms:
2.7.10.2 LCK_HUMAN Leukocyte C-terminal Src kinase Lymphocyte-specific protein tyrosine kinase Protein YT16 Proto-oncogene tyrosine-protein kinase LCK T cell-specific protein-tyrosine kinase
Type:
Mol. Mass.:
57987.83
Organism:
Homo sapiens (Human)
Description:
P06239
Residue:
509
  
Inhibitor
Name:
BDBM50245904
Synonyms:
CHEMBL459044 | N-(2,6-dimethylphenyl)-4-(2-ethoxyphenoxy)-2-(4-(piperazin-1-yl)phenylamino)pyrimidine-5-carboxamide
Type:
Small organic molecule
Emp. Form.:
C31H34N6O3
Mol. Mass.:
538.6401
SMILES:
CCOc1ccccc1Oc1nc(Nc2ccc(cc2)N2CCNCC2)ncc1C(=O)Nc1c(C)cccc1C
: