Target
Angiopoietin-1 receptor
Ligand
BDBM50245904
Substrate
Meas. Tech.
ChEMBL_559423 (CHEMBL1018104)
Ki
>8300±n/a nM
Citation
 Kopecky, DJHao, XChen, YFu, JJiao, XJaen, JCCardozo, MGLiu, JWang, ZWalker, NPWesche, HLi, SFarrelly, EXiao, SHKayser, F Identification and optimization of N3,N6-diaryl-1H-pyrazolo[3,4-d]pyrimidine-3,6-diamines as a novel class of ACK1 inhibitors. Bioorg Med Chem Lett 18:6352-6 (2008)  
Target
Name:
Angiopoietin-1 receptor
Synonyms:
TEK TIE2_HUMAN Tyrosine-protein kinase receptor (TIE-2) Tyrosine-protein kinase receptor TEK (p140 TEK) Tyrosine-protein kinase receptor TIE2/TEK VMCM1 p140 TEK
Type:
Enzyme
Mol. Mass.:
125835.70
Organism:
Homo sapiens (Human)
Description:
Q02763
Residue:
1124
  
Inhibitor
Name:
BDBM50245904
Synonyms:
CHEMBL459044 | N-(2,6-dimethylphenyl)-4-(2-ethoxyphenoxy)-2-(4-(piperazin-1-yl)phenylamino)pyrimidine-5-carboxamide
Type:
Small organic molecule
Emp. Form.:
C31H34N6O3
Mol. Mass.:
538.6401
SMILES:
CCOc1ccccc1Oc1nc(Nc2ccc(cc2)N2CCNCC2)ncc1C(=O)Nc1c(C)cccc1C
: