Target
Adenosine receptor A2a
Ligand
BDBM50218919
Substrate
Meas. Tech.
ChEMBL_559914 (CHEMBL1011025)
Ki
2680±n/a nM
Citation
 Colotta, VCapelli, FLenzi, OCatarzi, DVarano, FPoli, DVincenzi, FVarani, KBorea, PADal Ben, DVolpini, RCristalli, GFilacchioni, G Novel potent and highly selective human A(3) adenosine receptor antagonists belonging to the 4-amido-2-arylpyrazolo[3,4-c]quinoline series: molecular docking analysis and pharmacological studies. Bioorg Med Chem 17:401-10 (2008)  
Target
Name:
Adenosine receptor A2a
Synonyms:
A2A adenosine receptor (hA2A) ADENOSINE A2 ADORA2 Adenosine A2A receptor (A2AAR)
Type:
G Protein-Coupled Receptor (GPCR)
Mol. Mass.:
44716.46
Organism:
Homo sapiens (Human)
Description:
P29274
Residue:
412
  
Inhibitor
Name:
BDBM50218919
Synonyms:
CHEMBL242424 | N-(2-m-tolyl-2H-pyrazolo[3,4-c]quinolin-4-yl)benzamide
Type:
Small organic molecule
Emp. Form.:
C24H18N4O
Mol. Mass.:
378.4259
SMILES:
Cc1cccc(c1)-n1cc2c(n1)c(NC(=O)c1ccccc1)nc1ccccc21
: