Target
Potassium voltage-gated channel subfamily A member 5
Ligand
BDBM50254653
Substrate
Meas. Tech.
ChEMBL_559919 (CHEMBL1013713)
IC50
580±n/a nM
Citation
 Vaccaro, WHuynh, TLloyd, JAtwal, KFinlay, HJLevesque, PConder, MLJenkins-West, TShi, HSun, L Dihydropyrazolopyrimidine inhibitors of K(V)1.5 (I(Kur)). Bioorg Med Chem Lett 18:6381-5 (2008)  
Target
Name:
Potassium voltage-gated channel subfamily A member 5
Synonyms:
HK2 KCNA5 Potassium voltage-gated channel subfamily A member 5 Voltage-gated potassium channel subunit Kv1.5
Type:
Enzyme
Mol. Mass.:
67222.47
Organism:
Homo sapiens (Human)
Description:
P22460
Residue:
613
  
Inhibitor
Name:
BDBM50254653
Synonyms:
7-(3,4-dichlorophenyl)-5-methyl-N,N-dipentyl-4,7-dihydropyrazolo[1,5-a]pyrimidine-6-carboxamide | CHEMBL517025
Type:
Small organic molecule
Emp. Form.:
C24H32Cl2N4O
Mol. Mass.:
463.443
SMILES:
CCCCCN(CCCCC)C(=O)C1C(c2ccc(Cl)c(Cl)c2)n2nccc2N=C1C
: