Target
Motilin receptor
Ligand
BDBM50412537
Substrate
Meas. Tech.
ChEMBL_559937 (CHEMBL1013731)
EC50
2±n/a nM
Citation
 Westaway, SMBrown, SLConway, EHeightman, TDJohnson, CNLapsley, KMacdonald, GJMacPherson, DTMitchell, DJMyatt, JWSeal, JTStanway, SJStemp, GThompson, MCelestini, PColombo, AConsonni, AGagliardi, SRiccaboni, MRonzoni, SBriggs, MAMatthews, KLStevens, AJBolton, VJBoyfield, IJarvie, EMStratton, SCSanger, GJ The discovery of biaryl carboxamides as novel small molecule agonists of the motilin receptor. Bioorg Med Chem Lett 18:6429-36 (2008)  
Target
Name:
Motilin receptor
Synonyms:
G-protein coupled receptor 38 MLNR MTLR1 | MTLR_HUMAN
Type:
PROTEIN
Mol. Mass.:
45365.95
Organism:
Homo sapiens (Human)
Description:
ChEMBL_122664
Residue:
412
  
Inhibitor
Name:
BDBM50412537
Synonyms:
CHEMBL465917
Type:
Small organic molecule
Emp. Form.:
C30H35F2N5O
Mol. Mass.:
519.6286
SMILES:
C[C@H]1CN(Cc2ccc(cc2)-c2cccnc2C(=O)N2CCC(CC2)Nc2ccc(F)c(F)c2)C[C@@H](C)N1
: