Target
C-X-C chemokine receptor type 3
Ligand
BDBM50254758
Substrate
Meas. Tech.
ChEMBL_560732 (CHEMBL1010867)
IC50
31.62±n/a nM
Citation
 Wang, YBusch-Petersen, JWang, FKiesow, TJGraybill, TLJin, JYang, ZFoley, JJHunsberger, GESchmidt, DBSarau, HMCapper-Spudich, EAWu, ZFisher, LSMcQueney, MSRivero, RAWiddowson, KL Camphor sulfonamide derivatives as novel, potent and selective CXCR3 antagonists. Bioorg Med Chem Lett 19:114-8 (2008)  
Target
Name:
C-X-C chemokine receptor type 3
Synonyms:
AAO92295.1 C-X-C chemokine receptor type 3 (CXCR3) CXCR3 CXCR3_HUMAN chemokine (C-X-C motif) receptor 3
Type:
Enzyme Catalytic Domain
Mol. Mass.:
40665.65
Organism:
Homo sapiens (Human)
Description:
Residue:
368
  
Inhibitor
Name:
BDBM50254758
Synonyms:
(1S,2S,4R)-1-(((S)-4-(3-fluoro-5-(trifluoromethyl)pyridin-2-yl)-3-methylpiperazin-1-ylsulfonyl)methyl)-7,7-dimethylbicyclo[2.2.1]heptan-2-ol | CHEMBL464234
Type:
Small organic molecule
Emp. Form.:
C21H29F4N3O3S
Mol. Mass.:
479.532
SMILES:
C[C@H]1CN(CCN1c1ncc(cc1F)C(F)(F)F)S(=O)(=O)C[C@]12CC[C@H](C[C@@H]1O)C2(C)C
: