Target
Xanthine dehydrogenase/oxidase
Ligand
BDBM50254558
Substrate
Meas. Tech.
ChEMBL_558736 (CHEMBL954138)
IC50
110000±n/a nM
Citation
 Sato, TAshizawa, NIwanaga, TNakamura, HMatsumoto, KInoue, TNagata, O Design, synthesis, and pharmacological and pharmacokinetic evaluation of 3-phenyl-5-pyridyl-1,2,4-triazole derivatives as xanthine oxidoreductase inhibitors. Bioorg Med Chem Lett 19:184-7 (2008)  
Target
Name:
Xanthine dehydrogenase/oxidase
Synonyms:
XDH Xanthine dehydrogenase Xanthine oxidase (XO)
Type:
Protein
Mol. Mass.:
146809.00
Organism:
Bos taurus (Bovine)
Description:
P80457
Residue:
1332
  
Inhibitor
Name:
BDBM50254558
Synonyms:
2-(2-cyano-4-(5-(2-methylpyridin-4-yl)-2H-1,2,4-triazol-3-yl)phenoxy)acetic acid | CHEMBL462496
Type:
Small organic molecule
Emp. Form.:
C17H13N5O3
Mol. Mass.:
335.3168
SMILES:
Cc1cc(ccn1)-c1nnc([nH]1)-c1ccc(OCC(O)=O)c(c1)C#N
: