Target
Neuronal acetylcholine receptor subunit alpha-4
Ligand
BDBM50254484
Substrate
Meas. Tech.
ChEMBL_558775 (CHEMBL1020768)
Ki
790±n/a nM
Citation
 Hansen, CPJensen, AABalle, TBitsch-Jensen, KHassan, MMLiljefors, TFrølund, B Carbamoylcholine analogs as nicotinic acetylcholine receptor agonists--structural modifications of 3-(dimethylamino)butyl dimethylcarbamate (DMABC). Bioorg Med Chem Lett 19:87-91 (2008)  
Target
Name:
Neuronal acetylcholine receptor subunit alpha-4
Synonyms:
ACHA4_HUMAN CHRNA4 protein Neuronal acetylcholine receptor protein alpha-4 subunit Nicotinic acetylcholine receptor alpha4/beta2/alpha5
Type:
Mol. Mass.:
69963.49
Organism:
Homo sapiens (Human)
Description:
NACHRA4
Residue:
627
  
Inhibitor
Name:
BDBM50254484
Synonyms:
3-(dimethylamino)butyl ethylcarbamate | CHEMBL451633
Type:
Small organic molecule
Emp. Form.:
C9H20N2O2
Mol. Mass.:
188.2673
SMILES:
CCNC(=O)OCCC(C)N(C)C
: