Target
Casein kinase I isoform gamma-1
Ligand
BDBM50273635
Substrate
Meas. Tech.
ChEMBL_537117 (CHEMBL988949)
Kd
59±n/a nM
Citation
 Bamborough, PDrewry, DHarper, GSmith, GKSchneider, K Assessment of chemical coverage of kinome space and its implications for kinase drug discovery. J Med Chem 51:7898-914 (2008)  
Target
Name:
Casein kinase I isoform gamma-1
Synonyms:
CKI-gamma 1 Casein kinase I Casein kinase I isoform gamma-1 | KC1G1_HUMAN
Type:
PROTEIN
Mol. Mass.:
48530.93
Organism:
Homo sapiens (Human)
Description:
ChEMBL_774608
Residue:
422
  
Inhibitor
Name:
BDBM50273635
Synonyms:
1-(4-methyl-2,5-di(pyridin-4-yl)-1H-pyrrol-3-yl)ethanone | CHEMBL526901
Type:
Small organic molecule
Emp. Form.:
C17H15N3O
Mol. Mass.:
277.3205
SMILES:
CC(=O)c1c(C)c([nH]c1-c1ccncc1)-c1ccncc1
: