Target
Tyrosine-protein kinase Fyn
Ligand
BDBM26145
Substrate
Meas. Tech.
ChEMBL_537095 (CHEMBL988927)
Kd
0.400000±n/a nM
Citation
 Bamborough, PDrewry, DHarper, GSmith, GKSchneider, K Assessment of chemical coverage of kinome space and its implications for kinase drug discovery. J Med Chem 51:7898-914 (2008)  
Target
Name:
Tyrosine-protein kinase Fyn
Synonyms:
FYN Proto-oncogene Syn SLK Src-like kinase | p59-Fyn
Type:
Enzyme
Mol. Mass.:
60762.21
Organism:
Homo sapiens (Human)
Description:
P06241
Residue:
537
  
Inhibitor
Name:
BDBM26145
Synonyms:
2,4-dianilino pyrimidine, 2 CHEMBL249097
Type:
Small organic molecule
Emp. Form.:
C18H17N5O2
Mol. Mass.:
335.3599
SMILES:
Cc1ccc(O)cc1Nc1ccnc(Nc2cccc(c2)C(N)=O)n1
: