Target
Mast/stem cell growth factor receptor Kit
Ligand
BDBM50273636
Substrate
Meas. Tech.
ChEMBL_537122 (CHEMBL988956)
Kd
111±n/a nM
Citation
 Bamborough, PDrewry, DHarper, GSmith, GKSchneider, K Assessment of chemical coverage of kinome space and its implications for kinase drug discovery. J Med Chem 51:7898-914 (2008)  
Target
Name:
Mast/stem cell growth factor receptor Kit
Synonyms:
CD117 antigen KIT Mast/stem cell growth factor receptor Kit (cKIT) Proto-oncogene tyrosine-protein kinase Kit Stem cell growth factor receptor Tyrosine-protein kinase Kit c-kit v-kit Hardy-Zuckerman 4 feline sarcoma viral oncogene homolog
Type:
Protein
Mol. Mass.:
109869.37
Organism:
Homo sapiens (Human)
Description:
P10721
Residue:
976
  
Inhibitor
Name:
BDBM50273636
Synonyms:
4-(5-(4-fluorophenyl)-1H-pyrazol-3-ylamino)benzamide | CHEMBL511337
Type:
Small organic molecule
Emp. Form.:
C16H13FN4O
Mol. Mass.:
296.299
SMILES:
NC(=O)c1ccc(Nc2cc(n[nH]2)-c2ccc(F)cc2)cc1
: