Target
Ephrin type-A receptor 3
Ligand
BDBM50263295
Substrate
Meas. Tech.
ChEMBL_537100 (CHEMBL988932)
Kd
46±n/a nM
Citation
 Bamborough, PDrewry, DHarper, GSmith, GKSchneider, K Assessment of chemical coverage of kinome space and its implications for kinase drug discovery. J Med Chem 51:7898-914 (2008)  
Target
Name:
Ephrin type-A receptor 3
Synonyms:
EPHA3 ETK Ephrin receptor Ephrin type-A receptor 3 (EPHA3) TYRO4
Type:
Protein
Mol. Mass.:
110131.95
Organism:
Homo sapiens (Human)
Description:
P29320
Residue:
983
  
Inhibitor
Name:
BDBM50263295
Synonyms:
6-Methyl-biphenyl-3,4'-dicarboxylic acid 3-[(3-tert-butyl-phenyl)-amide] 4'-cyclopropylmethyl-amide N3-(3-tert-butylphenyl)-N4'-(cyclopropylmethyl)-6-methylbiphenyl-3,4'-dicarboxamide
Type:
Small organic molecule
Emp. Form.:
C29H32N2O2
Mol. Mass.:
440.5766
SMILES:
Cc1ccc(cc1-c1ccc(cc1)C(=O)NCC1CC1)C(=O)Nc1cccc(c1)C(C)(C)C
: