Target
Coagulation factor X
Ligand
BDBM50266114
Substrate
Meas. Tech.
ChEMBL_544730 (CHEMBL1010168)
Ki
0.14±n/a nM
Citation
 Qiao, JXKing, SRHe, KWong, PCRendina, ARLuettgen, JMXin, BKnabb, RMWexler, RRLam, PY Highly efficacious factor Xa inhibitors containing alpha-substituted phenylcycloalkyl P4 moieties. Bioorg Med Chem Lett 19:462-8 (2008)  
Target
Name:
Coagulation factor X
Synonyms:
Activated coagulation factor X (FXa) Coagulation factor X precursor F10 Factor X heavy chain Factor Xa Stuart-Prower factor
Type:
Enzyme
Mol. Mass.:
54726.60
Organism:
Homo sapiens (Human)
Description:
Residue:
488
  
Inhibitor
Name:
BDBM50266114
Synonyms:
2-((1-(4-(1-(4-methoxyphenyl)-7-oxo-3-(trifluoromethyl)-4,5-dihydro-1H-pyrazolo[3,4-c]pyridin-6(7H)-yl)phenyl)cyclopropyl)(methyl)amino)acetamide | CHEMBL512288
Type:
Small organic molecule
Emp. Form.:
C26H26F3N5O3
Mol. Mass.:
513.5115
SMILES:
COc1ccc(cc1)-n1nc(c2CCN(C(=O)c12)c1ccc(cc1)C1(CC1)N(C)CC(N)=O)C(F)(F)F
: