Target
Polyphenol oxidase 2
Ligand
BDBM50254430
Substrate
Meas. Tech.
ChEMBL_559525 (CHEMBL1018998)
Ki
230±n/a nM
Citation
 Baek, YSRyu, YBCurtis-Long, MJHa, TJRengasamy, RYang, MSPark, KH Tyrosinase inhibitory effects of 1,3-diphenylpropanes from Broussonetia kazinoki. Bioorg Med Chem 17:35-41 (2008)  
Target
Name:
Polyphenol oxidase 2
Synonyms:
Monophenol monooxygenase PPO2 Tyrosinase
Type:
Protein
Mol. Mass.:
63923.66
Organism:
Agaricus bisporus (Common mushroom)
Description:
O42713
Residue:
556
  
Inhibitor
Name:
BDBM50254430
Synonyms:
CHEMBL468906 | broussonin C
Type:
Small organic molecule
Emp. Form.:
C20H24O3
Mol. Mass.:
312.4028
SMILES:
[#6]\[#6](-[#6])=[#6]\[#6]-c1cc(-[#6]-[#6]-[#6]-c2ccc(-[#8])cc2-[#8])ccc1-[#8]
: