Target
Cytochrome P450 1A2
Ligand
BDBM50273678
Substrate
Meas. Tech.
ChEMBL_537842 (CHEMBL989843)
IC50
620±n/a nM
Citation
 Lucas, SHeim, RRies, CSchewe, KEBirk, BHartmann, RW In vivo active aldosterone synthase inhibitors with improved selectivity: lead optimization providing a series of pyridine substituted 3,4-dihydro-1H-quinolin-2-one derivatives. J Med Chem 51:8077-87 (2008)  
Target
Name:
Cytochrome P450 1A2
Synonyms:
CP1A2_HUMAN CYPIA2 Cytochrome P(3)450 Cytochrome P450 1A2 (CYP1A2) Cytochrome P450-P3
Type:
Enzyme
Mol. Mass.:
58423.38
Organism:
Homo sapiens (Human)
Description:
P05177
Residue:
516
  
Inhibitor
Name:
BDBM50273678
Synonyms:
3-(6-Ethoxy-5,6,7,8-tetrahydronaphthalen-2-yl)pyridine | CHEMBL459969
Type:
Small organic molecule
Emp. Form.:
C17H19NO
Mol. Mass.:
253.3389
SMILES:
CCOC1CCc2cc(ccc2C1)-c1cccnc1
: