Target
Cytochrome P450 2C9
Ligand
BDBM50273813
Substrate
Meas. Tech.
ChEMBL_537844 (CHEMBL989845)
IC50
2900±n/a nM
Citation
 Lucas, SHeim, RRies, CSchewe, KEBirk, BHartmann, RW In vivo active aldosterone synthase inhibitors with improved selectivity: lead optimization providing a series of pyridine substituted 3,4-dihydro-1H-quinolin-2-one derivatives. J Med Chem 51:8077-87 (2008)  
Target
Name:
Cytochrome P450 2C9
Synonyms:
(R)-limonene 6-monooxygenase CP2C9_HUMAN CYP2C9 Cytochrome P450 2C9 (CYP2C9 ) P-450MP P450 PB-1 | S-mephenytoin 4-hydroxylase
Type:
Enzyme
Mol. Mass.:
55636.33
Organism:
Homo sapiens (Human)
Description:
P11712
Residue:
490
  
Inhibitor
Name:
BDBM50273813
Synonyms:
6-Isoquinolin-4-yl-3,4-dihydroquinolin-2(1H)-one | CHEMBL456390
Type:
Small organic molecule
Emp. Form.:
C18H14N2O
Mol. Mass.:
274.3166
SMILES:
O=C1CCc2cc(ccc2N1)-c1cncc2ccccc12
: