Target
Cytochrome P450 2D6
Ligand
BDBM50273703
Substrate
Meas. Tech.
ChEMBL_537846 (CHEMBL989847)
IC50
171000±n/a nM
Citation
 Lucas, SHeim, RRies, CSchewe, KEBirk, BHartmann, RW In vivo active aldosterone synthase inhibitors with improved selectivity: lead optimization providing a series of pyridine substituted 3,4-dihydro-1H-quinolin-2-one derivatives. J Med Chem 51:8077-87 (2008)  
Target
Name:
Cytochrome P450 2D6
Synonyms:
CP2D6_HUMAN CYP2DL1 Cytochrome P450 2D6 (CYP2D6) P450-DB1
Type:
Protein
Mol. Mass.:
55774.82
Organism:
Homo sapiens (Human)
Description:
P10635
Residue:
497
  
Inhibitor
Name:
BDBM50273703
Synonyms:
6-Pyridin-3-yl-3,4-dihydronaphthalen-2(1H)-one | CHEMBL462093
Type:
Small organic molecule
Emp. Form.:
C15H13NO
Mol. Mass.:
223.2698
SMILES:
O=C1CCc2cc(ccc2C1)-c1cccnc1
: