Target
Cytochrome P450 11B1, mitochondrial
Ligand
BDBM50273675
Substrate
Meas. Tech.
ChEMBL_537835 (CHEMBL989836)
IC50
1977±n/a nM
Citation
 Lucas, SHeim, RRies, CSchewe, KEBirk, BHartmann, RW In vivo active aldosterone synthase inhibitors with improved selectivity: lead optimization providing a series of pyridine substituted 3,4-dihydro-1H-quinolin-2-one derivatives. J Med Chem 51:8077-87 (2008)  
Target
Name:
Cytochrome P450 11B1, mitochondrial
Synonyms:
C11B1_HUMAN CYPXIB1 Cytochrome P450 11B1 Cytochrome P450 11B1, mitochondrial | S11BH
Type:
Enzyme
Mol. Mass.:
57591.44
Organism:
Homo sapiens (Human)
Description:
P15538
Residue:
503
  
Inhibitor
Name:
BDBM50273675
Synonyms:
3-(5,6,7,8-Tetrahydronaphthalen-2-yl)pyridine | CHEMBL461457
Type:
Small organic molecule
Emp. Form.:
C15H15N
Mol. Mass.:
209.2863
SMILES:
C1CCc2cc(ccc2C1)-c1cccnc1
: